NOAA
type: Concept

DOC/NOAA/NESDIS/NCEI
type: Concept
change note: 2015-05-13 16:15:15.0 [epneff] added new data center information insert AltLabel (id: null text: National Centers for Environmental Information language code: en); insert Definition (id: null text: NOAA’s National Centers for Environmental Information (NCEI) are responsible for hosting and providing access to one of the most significant archives on earth, with comprehensive oceanic, atmospheric, and geophysical data. From the depths of the ocean to the surface of the sun and from million-year-old tree rings to near real-time satellite images, NCEI is the Nation’s leading authority for environmental information. By preserving, stewarding, and maximizing the utility of the Federal government’s billion-dollar investment in high-quality environmental data, NCEI remains committed to providing products and services to private industry and businesses, local to international governments, academia, as well as the general public. language code: en);
change note: 2022-11-03 17:01:33.0 [sritz] update Definition (https://www.ncei.noaa.gov/); update Resource (provider); update Resource (https://www.ncei.noaa.gov/);
change note: 2015-06-03 16:47:06.0 [epneff] Updated Long Name update AltLabel (National Centers for Environmental Information, NESDIS, NOAA, U.S. Department of Commerce);
change note: 2015-05-13 16:11:55.0 [epneff] Insert Concept add broader relation (DOC/NOAA/NESDIS/NCEI [e59896e0-3b4d-43ea-9348-f1f456305d05,157933] - NOAA [c9003d36-020d-4e86-995a-498945576c23,136019]);
definition: NOAA’s National Centers for Environmental Information (NCEI) are responsible for hosting and providing access to one of the most significant archives on earth, with comprehensive oceanic, atmospheric, and geophysical data. From the depths of the ocean to the surface of the sun and from million-year-old tree rings to near real-time satellite images, NCEI is the Nation’s leading authority for environmental information. By preserving, stewarding, and maximizing the utility of the Federal government’s billion-dollar investment in high-quality environmental data, NCEI remains committed to providing products and services to private industry and businesses, local to international governments, academia, as well as the general public.
in scheme: providers