OCEAN PRESSURE
type: Concept

SEA LEVEL PRESSURE
type: Concept
definition: The force per unit area exerted by the overlying atmosphere on a point at mean sea level, either measured directly or calculated from an observed air pressure not at mean sea level.
in scheme: sciencekeywords