ACADEMIC
type: Concept

NTU/ATMO
type: Concept
definition: The Department of Atmospheric Science at the National Taiwan University courses emphasize basic training in physics, mathematics, and computer science, as well as application of knowledge into the real world atmospheric problems. The courses can be divided into five categories: meteorology and dynamics, climatology, atmospheric environment, atmospheric observation, and earth science education. The research of the department focuses on synoptic meteorology, atmospheric dynamics, numerical weather prediction, and air pollution. Website: http://www.as.ntu.edu.tw/index.php?lang=en [Summary provided by National Taiwan University.]
in scheme: providers