ACADEMIC
type: Concept

COLUMBIA/LDEO/SEDDB
type: Concept
definition: edDB complements current geological data systems (PetDB, EarthChem, NavDat and GEOROC) with an integrated compilation of geochemistry of marine and continental sediments. Data can be applied to studies of sedimentology, geochemistry, petrology, oceanography, paleoclimate research, and for educational purposes. Summary Provided By: http://www.seddb.org/seddbWeb/index.jsp
in scheme: providers