Probes
type: Concept

CDP
type: Concept
definition: [Source: Global Hydrology Resource Center] Cloud Droplet probe is a miniature, lightweight, low-power cloud particle spectrometer that measures droplets in the range of 2-50 µm in concentrations as high as 2000 particles/cm3 Group: Instrument_Details Entry_ID: CDP Group: Instrument_Identification Instrument_Category: In Situ/Laboratory Instruments Instrument_Class: Probes Short_Name: CDP Long_Name: Cloud Droplet Probe End_Group Group: Associated_Platforms Short_Name: UND CITATION II Short_Name: DC-8 End_Group Online_Resource: http://ghrc.nsstc.nasa.gov/ Creation_Date: 2011-07-12 End_Group
in scheme: instruments