MINNESOTA
type: Concept

MN/HEALTH
type: Concept
change note: 2014-03-11 18:20:50.0 [sgrebas] insert AltLabel (id: null text: Department of Health, Minnesota language code: en);
change note: 2014-03-11 18:20:00.0 [sgrebas] Insert Concept add broader relation (MN/HEALTH [e8df433e-f868-4ad1-97e7-8610d60a86e3,106225] - MINNESOTA [7697ef45-ee36-4643-b110-e3f9777f4ede,66795]);
definition: Minnesota’s public health system is known as one of the best in the nation. It is built upon a strong partnership between the Minnesota Department of Health (MDH), local public health agencies, tribal governments and a range of other organizations. The department’s mission is to protect, maintain and improve the health of all Minnesotans. It has about 1,500 employees and an annual budget of approximately $500 million in state, federal and fee-based funds. [Summary provided by Minnesota Department of Health]
in scheme: providers