GLACIAL LANDFORMS
type: Concept

ROCHE MOUTONNEES/SHEEPBACK
type: Concept
change note: 2013-08-26 08:49:01.0 [tbs1979] insert Definition (id: null text: A rock formation created by the passing of a glacier. When a glacier erodes down to bedrock, it can form tear-drop shaped hills that taper in the up-ice direction. language code: en);
change note: 2013-08-06 14:46:24.0 [tbs1979] Insert Concept add broader relation (ROCHE MOUTONNEES/SHEEPBACK [e96cea31-2bee-4d9d-bf4a-d0f469aa3bd4,105633] - GLACIAL LANDFORMS [b895f4b5-5273-49ef-883f-b67d9f199505,105287]);
definition: A rock formation created by the passing of a glacier. When a glacier erodes down to bedrock, it can form tear-drop shaped hills that taper in the up-ice direction.
in scheme: sciencekeywords