Temperature/Humidity Sensors
type: Concept

TTS
type: Concept
change note: 2021-03-01 16:39:10.0 [sritz] insert AltLabel (id: null category: primary text: Total Temperature Sensor language code: en); insert Definition (id: null text: https://www.flightdatacommunity.com/wp-content/uploads/downloads/2013/02/TAT-Report.pdf language code: en);
change note: 2021-03-01 16:38:02.0 [sritz] Insert Concept add broader relation (TTS [ea416f82-6986-4411-bd05-139c0cc10da6,560902] - Temperature/Humidity Sensors [bb5a51d9-0ded-40ed-9bfd-7cb0e788f1a5,545515]);
definition: https://www.flightdatacommunity.com/wp-content/uploads/downloads/2013/02/TAT-Report.pdf
in scheme: instruments