MULTINATIONAL ORGANIZATIONS
type: Concept

WDC/IONOSPHERE, TOKYO
type: Concept
definition: Mission Statement Space Weather Prediction Center continually monitors and forecasts Earth's space environment; provides accurate, reliable, and useful solar-terrestrial information; conducts and leads research and development programs to understand the environment and to improve services; advises policy makers and planners; plays a leadership role in the space weather community; and fosters a space weather services industry. Space Weather Prediction Center is the Nation's official source of space weather alerts and warnings. Summary provided by http://www.swpc.noaa.gov/AboutUs/index.html
in scheme: providers