TELECONNECTIONS
type: Concept

SOUTHERN OSCILLATION INDEX
type: Concept
change note: 2020-02-18 08:53:10.0 [tstevens] Remove Concepts delete narrower relation (null);
change note: 2012-06-25 11:36:35.0 [mpmorahan] Insert Concept add narrower relation (SOUTHERN OSCILLATION INDEX [eaa0bc43-e283-4bf1-ba20-ca32850a66ef,39713] - SOI [cafeff8b-c583-40e3-9a43-2b2b069b1df8,39715]);
change note: 2012-07-09 12:21:48.0 [mpmorahan] insert Definition (id: null text: The Southern Oscillation Index (SOI) is computed using monthly mean sea level pressure anomalies at Tahiti (T) and Darwin (D). The SOI [T-D] is an optimal index that combines the Southern Oscillation into one series. The SOI noise [T+D] series is a measure of small scale and/or transient phenomena that are not part of the large scale Southern Oscillation. These SOI values are similar to those calculated by the Climate Prediction Center in that they have been derived using normalization factors derived from monthly values. language code: en);
change note: 2012-06-25 11:35:59.0 [mpmorahan] Insert Concept add broader relation (SOUTHERN OSCILLATION INDEX [eaa0bc43-e283-4bf1-ba20-ca32850a66ef,39713] - TELECONNECTIONS [b887d3e5-4280-43d2-a34e-0f63ac086b6a,20219]);
definition: The Southern Oscillation Index (SOI) is computed using monthly mean sea level pressure anomalies at Tahiti (T) and Darwin (D). The SOI [T-D] is an optimal index that combines the Southern Oscillation into one series. The SOI noise [T+D] series is a measure of small scale and/or transient phenomena that are not part of the large scale Southern Oscillation. These SOI values are similar to those calculated by the Climate Prediction Center in that they have been derived using normalization factors derived from monthly values.
in scheme: sciencekeywords