WIND DYNAMICS
type: Concept

STREAMFUNCTIONS
type: Concept
change note: 2017-04-21 11:18:17.0 [tstevens] update Definition (A parameter of two-dimensional, nondivergent flow, with a value that is constant along each streamline.); update Definition (Glossary of Meteorology, American Meteorological Society);
change note: 2017-04-20 14:37:51.0 [sritz] Move Concepts delete broader relation (null); add broader relation (STREAMFUNCTIONS [eaeb5cdd-365f-4368-8e20-6defe111b3b4,83351] - WIND DYNAMICS [492ffe26-8fbe-4d7d-a537-495fb96bdcce,278857]);
definition: A parameter of two-dimensional, nondivergent flow, with a value that is constant along each streamline.
in scheme: sciencekeywords