Radar Sounders
type: Concept

DOPPLER RADAR
type: Concept
change note: 2021-08-04 17:13:29.0 [sritz] insert AltLabel (id: null category: primary text: DOPPLER RADAR language code: en);
definition: A DOPPLER RADAR is a measuring instrument in which the echo of a pulse of microwave radiation is used to detect and locate distant objects; used for weather forecasting and observation of weather patterns.
in scheme: instruments