Vehicles
type: Concept

SV
type: Concept
change note: 2022-02-08 14:47:34.0 [tstevens] delete Resource (null);
change note: 2022-02-08 14:47:14.0 [tstevens] update Definition (A vehicle that is specifically designed to to be driven primarily on snow.); update Resource (image);
change note: 2021-11-18 08:33:41.0 [tstevens] Move Concepts delete broader relation (null); add broader relation (SV [eb24a648-bc31-48ad-935a-bbd2621da456,826871] - Vehicles [8dc44d7b-e349-42ab-860e-18f5acfc1b28,835888]);
definition: A vehicle that is specifically designed to to be driven primarily on snow.
in scheme: platforms