FOOD SCIENCE
type: Concept

FOOD ADDITIVES
type: Concept
definition: Any measure related to any substance that is added to food, either directly or indirectly, to improve nutrition, taste, or shelf life. Examples include colorants, flavorings, seasonings, emulsifiers, stabilizers, thickeners, sweeteners, preservatives, antioxidants, etc.
in scheme: sciencekeywords