Chemical Meters/Analyzers
type: Concept

GNI
type: Concept
change note: 2021-09-29 08:32:07.0 [tstevens] insert AltLabel (id: null category: primary text: Giant Nuclei Impactor language code: en); insert Definition (id: null text: This instrument has been flown on multiple earth system science-focused field research campaigns, and as a mature instrument, will continue to be operated in future field research campaigns. language code: en);
change note: 2021-09-29 08:30:44.0 [tstevens] Insert Concept add broader relation (GNI [ec165cc6-324d-4be1-8ace-48a660a1f900,749516] - Chemical Meters/Analyzers [3d25724b-832f-4a61-b0b2-4f2ccecdba94,741076]);
definition: This instrument has been flown on multiple earth system science-focused field research campaigns, and as a mature instrument, will continue to be operated in future field research campaigns.
in scheme: instruments