CLIVAR AND CARBON HYDROGRAPHIC DATA OFFICE
type: Concept

CLIVAR/CCHDO
type: Concept
change note: 2015-04-14 15:37:29.0 [gee-cee] Move Concepts delete broader relation (null); add broader relation (CLIVAR/CCHDO [ed0a7d29-1e7e-43c2-baa4-452de3609d61,139549] - CLIVAR AND CARBON HYDROGRAPHIC DATA OFFICE [bf1f5645-6622-4f80-9691-de9e433b95c0,139545]);
change note: 2015-04-14 15:37:22.0 [gee-cee] Move Concepts delete broader relation (null); add broader relation (CLIVAR/CCHDO [ed0a7d29-1e7e-43c2-baa4-452de3609d61,139549] - CLIVAR/CCHDO [ad87ea55-0ae0-4c1d-9ce9-1e3de4d2855e,139547]);
definition: The CCHDO's primary mission is to be a repository and distribution center for CTD and Hydrographic data sets of the highest possible quality. These data are a product of WOCE, CLIVAR and numerous other oceanographic research programs -- past, present and to come. Whenever possible we provide these data in three widely-used formats: WOCE, netCDF and WHP-Exchange, which we recommend for data submissions to the CCHDO.
in scheme: providers