SWEDEN
type: Concept

SE/ST/SMNH
type: Concept
definition: Our vision is to "increase all people's understanding of nature and its diversity". Nature is amazing and rich, but also under threat. Nature is amazing and rich, but also under threat. We want everyone, young and old, expert and novice, to learn more about nature, view it from a holistic perspective and respect man´s place in it. We want everyone, young and old, expert and novice, to learn more about nature, view it from a holistic perspective and respect man's place in it. Summary Provided By: http://translate.google.com/translate?hl=en&sl=sv&u=http://www.nrm.se/&sa=X&oi=translate&resnum=1&ct=result&prev=/search%3Fq%3DThe%2BSwedish%2BMuseum%2Bof%2BNatural%2BHistory,%2BStockholm,%2BSweden%26hl%3Den%26client%3Dfirefox-a%26rls%3Dorg.mozilla:en-US:official%26hs%3DbXW%26sa%3DX
in scheme: providers