Acoustic Sounders
type: Concept

ACOUSTIC TAGS
type: Concept
definition: Acoustic tags are small sound-emitting devices that allow the detection and/or remote tracking of fish in three dimensions. Commonly used to monitor the behavior of fish, studies are conducted in lakes, rivers, tributaries, estuaries and at sea. Acoustic tag tracking technology allows researchers to view 3D fish tracks in real-time with sub-meter resolution. Group: Instrument_Details Entry_ID: ACOUSTIC TAGS Group: Instrument_Identification Instrument_Category: In Situ/Laboratory Instruments Instrument_Class: Profilers/Sounders Instrument_Type: Acoustic Sounders Short_Name: ACOUSTIC TAGS End_Group Group: Instrument_Associated_Sensors Short_Name: ACOUSTIC TAGS End_Group Online_Resource: http://en.wikipedia.org/wiki/Acoustic_Tags Sample_Image: http://upload.wikimedia.org/wikipedia/commons/7/72/Acoustic_Tags.jpg Creation_Date: 2008-03-18 End_Group
in scheme: instruments