Propeller
type: Concept

CESSNA 172 SKYHAWK
type: Concept
change note: 2022-02-20 12:20:43.0 [tstevens] update Definition (The Cessna 172 Skyhawk is a four-seat, single-engine, high-wing airplane. More Cessna 172s have been built than any other aircraft. It is probably the most popular flight training aircraft in the world. Measured by its longevity and popularity, the Cessna 172 is the most successful mass produced light aircraft in history. The first production models were delivered in 1956 and they are still in production as of 2008; more than 43,000 have been built.[1] The Skyhawk's main competitors have been the Beechcraft Musketeer and Grumman AA-5 series (neither in production), the Piper Cherokee and, more recently, the Diamond DA40. The Cessna 172 started life as a tricycle landing gear upgrade from the taildragger Cessna 170, with a basic level of standard equipment. The first flight of the prototype was in November 1955. The 172 became an overnight sales success and over 1400 were built in 1956, its first full year of production. Early 172s were similar in appearance to the 170, with the same straight aft fuselage and tall gear legs, although the 172 had a straight vertical tail while the 170 had a rounded fin and rudder. Later 172 versions incorporated revised landing gear and the sweptback tail which is still in use today.The final aesthetic development in the mid-1960s, was a lowered rear deck that allowed an aft window. Cessna advertised this added rear visibility as "Omni-Vision" . This airframe configuration has remained almost unchanged since then, except for updates in avionics and engines, including the Garmin G1000 glass cockpit in 2005. Production had been halted in the mid-1980s, but was resumed in 1996 with the 160 hp (120 kW) Cessna 172R Skyhawk and was supplemented in 1998 by the 180 hp (135 kW) Cessna 172S Skyhawk SP.); update Resource (image);
change note: 2021-11-17 11:52:34.0 [tstevens] Move Concepts delete broader relation (null); add broader relation (CESSNA 172 SKYHAWK [ee829117-a171-4500-a0a5-81cac07f1071,826882] - Propeller [6175c78e-432c-4254-b442-40d3cf0f6b34,835882]);
definition: The Cessna 172 Skyhawk is a four-seat, single-engine, high-wing airplane. More Cessna 172s have been built than any other aircraft. It is probably the most popular flight training aircraft in the world. Measured by its longevity and popularity, the Cessna 172 is the most successful mass produced light aircraft in history. The first production models were delivered in 1956 and they are still in production as of 2008; more than 43,000 have been built.[1] The Skyhawk's main competitors have been the Beechcraft Musketeer and Grumman AA-5 series (neither in production), the Piper Cherokee and, more recently, the Diamond DA40. The Cessna 172 started life as a tricycle landing gear upgrade from the taildragger Cessna 170, with a basic level of standard equipment. The first flight of the prototype was in November 1955. The 172 became an overnight sales success and over 1400 were built in 1956, its first full year of production. Early 172s were similar in appearance to the 170, with the same straight aft fuselage and tall gear legs, although the 172 had a straight vertical tail while the 170 had a rounded fin and rudder. Later 172 versions incorporated revised landing gear and the sweptback tail which is still in use today.The final aesthetic development in the mid-1960s, was a lowered rear deck that allowed an aft window. Cessna advertised this added rear visibility as "Omni-Vision" . This airframe configuration has remained almost unchanged since then, except for updates in avionics and engines, including the Garmin G1000 glass cockpit in 2005. Production had been halted in the mid-1980s, but was resumed in 1996 with the 160 hp (120 kW) Cessna 172R Skyhawk and was supplemented in 1998 by the 180 hp (135 kW) Cessna 172S Skyhawk SP.
in scheme: platforms