NITROGEN COMPOUNDS
type: Concept

NITROGEN
type: Concept
change note: 2022-03-03 17:42:08.0 [sritz] Insert Concept add broader relation (NITROGEN [ef36cb15-ad64-4bdc-9331-42cc5b493671,836067] - NITROGEN COMPOUNDS [9e5ec924-2fd3-4cbb-a7eb-ffde114d0cb9,832492]);
definition: Nitrogen is a chemical element with symbol N and atomic number 7. Classified as a nonmetal, Nitrogen is a gas at room temperature.
in scheme: sciencekeywords