CREVASSES
type: Concept

MARGINAL CREVASSES
type: Concept
change note: 2013-08-23 14:50:58.0 [tbs1979] insert Definition (id: null text: Crevasses that form from the edge of the glacier, due to the reduction in speed caused by friction of the valley walls. language code: en);
change note: 2013-08-06 14:48:37.0 [tbs1979] Insert Concept add broader relation (MARGINAL CREVASSES [f0bbea2f-2ef0-4e99-ad76-1aedbbedc016,105641] - CREVASSES [b1d30791-5871-474f-aedf-2d4aa51e2b92,105603]);
definition: Crevasses that form from the edge of the glacier, due to the reduction in speed caused by friction of the valley walls.
in scheme: sciencekeywords