Photon/Optical Detectors
type: Concept

POLARIMETERS
type: Concept
change note: 2023-07-25 10:48:31.0 [tstevens] Insert Concept add narrower relation (POLARIMETERS [f17d0ef3-2f14-4276-9361-cbd9deb97110,1387407] - HARP2 [fb7ac8bf-b969-47a6-aaf6-3173401e442c,1395063]);
change note: 2021-08-05 16:41:14.0 [sritz] insert AltLabel (id: null category: primary text: POLARIMETERS language code: en);
definition: POLARIMETERS are instruments used for determining the degree of polarization of light.
in scheme: instruments

HARP2
type: Concept