TEMPERATURE INDICES
type: Concept

RESIDENTIAL ENERGY DEMAND TEMPERATURE INDEX
type: Concept
change note: 2012-07-09 15:28:23.0 [mpmorahan] insert Definition (id: null text: The Residential Energy Demand Temperature Index (REDTI) is based on population weighted* heating and cooling degree days, and as such, is a valuable tool for explaining year-to-year fluctuations in energy demand for residential heating and cooling. Residential energy consumption is known to be highly correlated with heating and cooling degree days. language code: en);
change note: 2012-06-26 10:24:59.0 [gee-cee] Insert Concept add broader relation (RESIDENTIAL ENERGY DEMAND TEMPERATURE INDEX [f19ff7fb-fd8b-433c-88e2-afc5dd3ee7b2,39801] - TEMPERATURE INDICES [e8580cbb-701a-4ab1-a40f-5fae4ae1ea24,39791]);
definition: The Residential Energy Demand Temperature Index (REDTI) is based on population weighted* heating and cooling degree days, and as such, is a valuable tool for explaining year-to-year fluctuations in energy demand for residential heating and cooling. Residential energy consumption is known to be highly correlated with heating and cooling degree days.
in scheme: sciencekeywords