AMBIENT NOISE
type: Concept

TOTAL AMBIENT NOISE
type: Concept
change note: 2021-10-19 09:26:20.0 [tstevens] insert Definition (id: null text: Ocean ambient noise assessments as a result of wind, ice, tectonic activity, and anthropocentric sources. Ambient noise may have profound effects on marine animals and ecosystems that use sound for navigation/communication. language code: en);
change note: 2021-10-19 09:25:00.0 [tstevens] Insert Concept add broader relation (TOTAL AMBIENT NOISE [f1f90445-4272-4390-92b1-2efc626a9ed1,778200] - AMBIENT NOISE [a74abbc1-dd75-4f22-bbec-7d45091a4593,775377]);
definition: Ocean ambient noise assessments as a result of wind, ice, tectonic activity, and anthropocentric sources. Ambient noise may have profound effects on marine animals and ecosystems that use sound for navigation/communication.
in scheme: sciencekeywords