CONSORTIA/INSTITUTIONS
type: Concept

GRAMENE
type: Concept
definition: Gramene: A Comparative Mapping Resource for Grains Gramene is a curated, open-source, Web-accessible data resource for comparative genome analysis in the grasses. Our goal is to facilitate the study of cross-species homology relationships using information derived from public projects involved in genomic and EST sequencing, protein structure and function analysis, genetic and physical mapping, interpretation of biochemical pathways, gene and QTL localization and descriptions of phenotypic characters and mutations. Website: "http://www.gramene.org/" [Summary provided by Gramene.]
in scheme: providers