MULTINATIONAL ORGANIZATIONS
type: Concept

INTERMAGNET
type: Concept
definition: INTERMAGNET is the the global network of observatories, monitoring the Earth's magnetic field. At this site you can find data and information from geomagnetic observatories around the world. The INTERMAGNET programme exists to establish a global network of cooperating digital magnetic observatories, adopting modern standard specifications for measuring and recording equipment, in order to facilitate data exchanges and the production of geomagnetic products in close to real time. Website: "http://www.intermagnet.org/index.html" [Summary provided by INTERMAGNET.]
in scheme: providers