MARINE VOLCANISM
type: Concept

RIFT VALLEYS
type: Concept
definition: Pertaining to the valley that forms down the center of a mid-ocean ridge where the formation of oceanic crust occurs.
in scheme: sciencekeywords