NASA Earth System Science Pathfinder
type: Concept

CloudSat
type: Concept
alternative label: CLOUDSAT
change note: 2018-04-17 12:18:02.0 [sritz] update Definition ([Source: NASA Science Missions Home Page] CloudSat uses advanced radar to "slice" through clouds to see their vertical structure, providing a completely new observational capability from space. Earlier satellites could only image the uppermost layers of clouds. CloudSat is among the first satellites to study clouds on a global basis. It will look at their structure, composition and effects. This is a cooperative mission with Canada. CloudSat measurements have applications in air quality, weather models, water management, aviation safety, and disaster management. The key observations are the vertical profiles of cloud liquid water and ice water contents and related cloud physical and radiative properties. The spacecraft payload consists of a millimeter-wave radar. CloudSat will fly in tight formation with the CALIPSO satellite carrying a backscattering lidar, and these two satellites will follow behind the Aqua satellite in a somewhat looser formation. The combination of data from the CloudSat radar with coincident measurements from CALIPSO and Aqua provides a rich source of information that can be used to assess the role of clouds in both weather and climate. CloudSat was launched on 2006-04-28 from Vandenberg AFB, California More Information: http://cloudsat.atmos.colostate.edu/ Group: Platform_Details Entry_ID: CloudSat Group: Platform_Identification Platform_Category: Earth Observation Satellites Platform_Series_or_Entity: EOS (Earth Observing System) Short_Name: CloudSat End_Group Group: Synonymous_Platform_Names Short_Name: CloudSat End_Group Group: Platform_Associated_Instruments Short_Name: CloudSat-CPR End_Group Group: Orbit Orbit_Altitude: 705 km Orbit_Inclination: 98.2 Degrees Period: 99 Minutes Repeat_Cycle: 16 Days Orbit_Type: LEO > Low Earth Orbit > Polar Sun-Synchronous End_Group Creation_Date: 2007-04-17 Online_Resource: https://cloudsat.atmos.colostate.edu/ Online_Resource: https://www.nasa.gov/mission…
change note: 2018-03-13 14:16:56.0 [sritz] update Definition ([Source: NASA Science Missions Home Page] CloudSat uses advanced radar to "slice" through clouds to see their vertical structure, providing a completely new observational capability from space. Earlier satellites could only image the uppermost layers of clouds. CloudSat is among the first satellites to study clouds on a global basis. It will look at their structure, composition and effects. This is a cooperative mission with Canada. CloudSat measurements have applications in air quality, weather models, water management, aviation safety, and disaster management. The key observations are the vertical profiles of cloud liquid water and ice water contents and related cloud physical and radiative properties. The spacecraft payload consists of a millimeter-wave radar. CloudSat will fly in tight formation with the CALIPSO satellite carrying a backscattering lidar, and these two satellites will follow behind the Aqua satellite in a somewhat looser formation. The combination of data from the CloudSat radar with coincident measurements from CALIPSO and Aqua provides a rich source of information that can be used to assess the role of clouds in both weather and climate. CloudSat was launched on 2006-04-28 from Vandenberg AFB, California More Information: http://cloudsat.atmos.colostate.edu/ Group: Platform_Details Entry_ID: CLOUDSAT Group: Platform_Identification Platform_Category: Earth Observation Satellites Platform_Series_or_Entity: EOS (Earth Observing System) Short_Name: CLOUDSAT End_Group Group: Synonymous_Platform_Names Short_Name: CLOUDSAT End_Group Group: Platform_Associated_Instruments Short_Name: CLOUDSAT-CPR End_Group Group: Orbit Orbit_Altitude: 705 km Orbit_Inclination: 98.2 Degrees Period: 99 Minutes Repeat_Cycle: 16 Days Orbit_Type: LEO > Low Earth Orbit > Polar Sun-Synchronous End_Group Creation_Date: 2007-04-17 Online_Resource: https://cloudsat.atmos.colostate.edu/ Online_Resource: https://www.nasa.gov/mission…
change note: 2020-01-02 17:42:45.0 [sritz] delete Resource (null);
change note: 2020-01-02 17:48:59.0 [sritz] update Definition ([Source: NASA Science Missions Home Page] CloudSat uses advanced radar to "slice" through clouds to see their vertical structure, providing a completely new observational capability from space. Earlier satellites could only image the uppermost layers of clouds. CloudSat is among the first satellites to study clouds on a global basis. It will look at their structure, composition and effects. This is a cooperative mission with Canada. CloudSat measurements have applications in air quality, weather models, water management, aviation safety, and disaster management. The key observations are the vertical profiles of cloud liquid water and ice water contents and related cloud physical and radiative properties. The spacecraft payload consists of a millimeter-wave radar. CloudSat will fly in tight formation with the CALIPSO satellite carrying a backscattering lidar, and these two satellites will follow behind the Aqua satellite in a somewhat looser formation. The combination of data from the CloudSat radar with coincident measurements from CALIPSO and Aqua provides a rich source of information that can be used to assess the role of clouds in both weather and climate. CloudSat was launched on 2006-04-28 from Vandenberg AFB, California More Information: http://cloudsat.atmos.colostate.edu/ Group: Platform_Details Entry_ID: CloudSat Group: Platform_Identification Platform_Category: Earth Observation Satellites Platform_Series_or_Entity: EOS (Earth Observing System) Short_Name: CloudSat End_Group Group: Synonymous_Platform_Names Short_Name: CloudSat End_Group Group: Platform_Associated_Instruments Short_Name: CloudSat-CPR End_Group Group: Orbit Orbit_Altitude: 705 km Orbit_Inclination: 98.2 Degrees Period: 99 Minutes Repeat_Cycle: 16 Days Orbit_Type: LEO > Low Earth Orbit > Polar Sun-Synchronous End_Group Creation_Date: 2007-04-17 Online_Resource: https://cloudsat.atmos.colostate.edu/ Online_Resource: https://www.nasa.gov/mission…
change note: 2018-03-13 14:15:08.0 [sritz] insert AltLabel (id: null category: null text: CLOUDSAT language code: en); update PrefLabel (CloudSat); update Definition ([Source: NASA Science Missions Home Page] CloudSat uses advanced radar to "slice" through clouds to see their vertical structure, providing a completely new observational capability from space. Earlier satellites could only image the uppermost layers of clouds. CloudSat is among the first satellites to study clouds on a global basis. It will look at their structure, composition and effects. This is a cooperative mission with Canada. CloudSat measurements have applications in air quality, weather models, water management, aviation safety, and disaster management. The key observations are the vertical profiles of cloud liquid water and ice water contents and related cloud physical and radiative properties. The spacecraft payload consists of a millimeter-wave radar. CloudSat will fly in tight formation with the CALIPSO satellite carrying a backscattering lidar, and these two satellites will follow behind the Aqua satellite in a somewhat looser formation. The combination of data from the CloudSat radar with coincident measurements from CALIPSO and Aqua provides a rich source of information that can be used to assess the role of clouds in both weather and climate. CloudSat was launched on 2006-04-28 from Vandenberg AFB, California Group: Platform_Details Entry_ID: CLOUDSAT Group: Platform_Identification Platform_Category: Earth Observation Satellites Platform_Series_or_Entity: EOS (Earth Observing System) Short_Name: CLOUDSAT End_Group Group: Synonymous_Platform_Names Short_Name: CLOUDSAT End_Group Group: Platform_Associated_Instruments Short_Name: CLOUDSAT-CPR End_Group Group: Orbit Orbit_Altitude: 705 km Orbit_Inclination: 98.2 Degrees Period: 99 Minutes Repeat_Cycle: 16 Days Orbit_Type: LEO > Low Earth Orbit > Polar Sun-Synchronous End_Group Creation_Date: 2007-04-17 Online_Resource: https://cloudsat.atmos.colostate.…
change note: 2018-03-12 14:50:17.0 [sritz] update Definition ([Source: NASA Science Missions Home Page, http://nasascience.nasa.gov/missions/cloudsat ] CloudSat uses advanced radar to "slice" through clouds to see their vertical structure, providing a completely new observational capability from space. Earlier satellites could only image the uppermost layers of clouds. CloudSat is among the first satellites to study clouds on a global basis. It will look at their structure, composition and effects. This is a cooperative mission with Canada. CloudSat measurements have applications in air quality, weather models, water management, aviation safety, and disaster management. The key observations are the vertical profiles of cloud liquid water and ice water contents and related cloud physical and radiative properties. The spacecraft payload consists of a millimeter-wave radar. CloudSat will fly in tight formation with the CALIPSO satellite carrying a backscattering lidar, and these two satellites will follow behind the Aqua satellite in a somewhat looser formation. The combination of data from the CloudSat radar with coincident measurements from CALIPSO and Aqua provides a rich source of information that can be used to assess the role of clouds in both weather and climate. CloudSat was launched on 2006-04-28 from Vandenberg AFB, California Group: Platform_Details Entry_ID: CLOUDSAT Group: Platform_Identification Platform_Category: Earth Observation Satellites Platform_Series_or_Entity: EOS (Earth Observing System) Short_Name: CLOUDSAT End_Group Group: Synonymous_Platform_Names Short_Name: CLOUDSAT End_Group Group: Platform_Associated_Instruments Short_Name: CLOUDSAT-CPR End_Group Group: Orbit Orbit_Altitude: 705 km Orbit_Inclination: 98.2 Degrees Period: 99 Minutes Repeat_Cycle: 16 Days Orbit_Type: LEO > Low Earth Orbit > Polar Sun-Synchronous End_Group Creation_Date: 2007-04-17 Online_Resource: https://cloudsat.atmos.colostate.edu/ Online_Resource: https://www.nasa.gov/mission_pages/…
definition: [Source: NASA Science Missions Home Page] CloudSat uses advanced radar to "slice" through clouds to see their vertical structure, providing a completely new observational capability from space. Earlier satellites could only image the uppermost layers of clouds. CloudSat is among the first satellites to study clouds on a global basis. It will look at their structure, composition and effects. This is a cooperative mission with Canada. CloudSat measurements have applications in air quality, weather models, water management, aviation safety, and disaster management. The key observations are the vertical profiles of cloud liquid water and ice water contents and related cloud physical and radiative properties. The spacecraft payload consists of a millimeter-wave radar. CloudSat will fly in tight formation with the CALIPSO satellite carrying a backscattering lidar, and these two satellites will follow behind the Aqua satellite in a somewhat looser formation. The combination of data from the CloudSat radar with coincident measurements from CALIPSO and Aqua provides a rich source of information that can be used to assess the role of clouds in both weather and climate. CloudSat was launched on 2006-04-28 from Vandenberg AFB, California More Information: http://cloudsat.atmos.colostate.edu/ Group: Platform_Details Entry_ID: CloudSat Group: Platform_Identification Platform_Category: Earth Observation Satellites Platform_Series_or_Entity: EOS (Earth Observing System) Short_Name: CloudSat End_Group Group: Synonymous_Platform_Names Short_Name: CloudSat End_Group Group: Platform_Associated_Instruments Short_Name: CloudSat-CPR End_Group Group: Orbit Orbit_Altitude: 705 km Orbit_Inclination: 98.2 Degrees Period: 99 Minutes Repeat_Cycle: 16 Days Orbit_Type: LEO > Low Earth Orbit > Polar Sun-Synchronous End_Group Creation_Date: 2007-04-17 Online_Resource: https://cloudsat.atmos.colostate.edu/ Online_Resource: https://www.nasa.gov/mission_pages/cloudsat/ Online_Resource: https://www.jpl…
in scheme: platforms