ANGIOSPERMS (FLOWERING PLANTS)
type: Concept

DICOTS
type: Concept
change note: 2017-03-15 11:13:13.0 [mgenazzi] Definition added insert Definition (id: null text: Dicots are plants that are have two cotyledons in the seeds, distinguished by the structure of their pollen with three furrows, flowers in multiples of four or five, reticulated leaf veins, stem vascular bundles in a ring and roots that develop from a radicle. language code: en);
definition: Dicots are plants that are have two cotyledons in the seeds, distinguished by the structure of their pollen with three furrows, flowers in multiples of four or five, reticulated leaf veins, stem vascular bundles in a ring and roots that develop from a radicle.
in scheme: sciencekeywords