Chemical Meters/Analyzers
type: Concept

LI-6252
type: Concept
change note: 2021-05-10 13:41:46.0 [tstevens] insert AltLabel (id: null category: primary text: LI-6252 CO2 Analyzer language code: en); insert Definition (id: null text: The LI-610 is a precision instrument that provides a controlled water vaporsource of known dew point. The LI-610 has the ability to generate stabledew points from 0 to 50 °C with high accuracy (± 0.2 °C). The water vaporsource can be derived from any input air stream, including ambient air,eliminating the need for external tanks or mixing of gases. language code: en);
change note: 2021-05-10 13:38:35.0 [tstevens] Insert Concept add broader relation (LI-6252 [f425ddec-c609-4f95-b098-88bfe59761a1,606912] - Chemical Meters/Analyzers [3d25724b-832f-4a61-b0b2-4f2ccecdba94,598603]);
definition: The LI-610 is a precision instrument that provides a controlled water vaporsource of known dew point. The LI-610 has the ability to generate stabledew points from 0 to 50 °C with high accuracy (± 0.2 °C). The water vaporsource can be derived from any input air stream, including ambient air,eliminating the need for external tanks or mixing of gases.
in scheme: instruments