CRYOSPHERIC INDICATORS
type: Concept

ICE EDGES
type: Concept
change note: 2012-07-10 11:18:50.0 [mpmorahan] insert Definition (id: null text: The ice edge is the demarcation at any given time between open water and the sea (can also refer to river and lake ice) whether fast or drifting. language code: en);
change note: 2012-06-26 13:33:36.0 [gee-cee] Insert Concept add broader relation (ICE EDGES [f4c1a555-4758-47ce-baa6-536730333833,39923] - CRYOSPHERIC INDICATORS [76b8c21c-c221-4724-86ef-c07222cb152b,39899]);
definition: The ice edge is the demarcation at any given time between open water and the sea (can also refer to river and lake ice) whether fast or drifting.
in scheme: sciencekeywords