ATMOSPHERIC PRESSURE
type: Concept

PLANETARY BOUNDARY LAYER HEIGHT
type: Concept
definition: The height of the atmospheric layer from the Earth's surface up to an altitude of about 1 kilometer in which wind speed and direction are affected by frictional interaction with objects on the Earth's surface.
in scheme: sciencekeywords