RUNOFF RATE
type: Concept
change note: 2016-04-04 09:33:22.0 [gee-cee] update Definition (Rate at which water is discharged in surface streams.);
change note: 2016-03-31 09:46:00.0 [gee-cee] insert Definition (id: null text: Rate at which water is discharged in surface streams language code: en);
change note: 2016-03-31 09:45:18.0 [gee-cee] Insert Concept add broader relation (RUNOFF RATE [f54d4750-b9b3-47fa-b56a-a1d57fcbc978,158757] - RUNOFF [f6a54329-486b-4d5f-b105-c639cec42351,86181]);
definition: Rate at which water is discharged in surface streams.
in scheme: sciencekeywords

RUNOFF
type: Concept