ACADEMIC
type: Concept

U-FF/DG
type: Concept
change note: 2012-07-30 14:07:06.0 [aaleman] Insert Concept add broader relation (U-FF/DG [f57fe266-e11d-4d84-b240-3c544b7d3a56,40401] - ACADEMIC [7700280b-68ee-4644-bf5e-84e7a6adf897,24357]);
definition: The Fluminense Federal University (Portuguese: Universidade Federal Fluminense, UFF) is one of the four federally funded public universities in the State of Rio de Janeiro, Brazil.
in scheme: providers