Gravimeters
type: Concept

FG5
type: Concept
change note: 2019-04-30 13:09:09.0 [sritz] insert Definition (id: null text: Micro-g LaCoste is proud to announce the new state of the art in absolute gravity measurements! The FG5-X is a “follow on” instrument to the “absolute standard” that is the FG5 freefall gravimeter. The FG5-X featrues an improved dropping chamber and an improved electronic interface. More Information: http://microglacoste.com/product/fg5-x-fgl-absolute-gravimeter/ language code: en);
change note: 2019-04-30 13:07:59.0 [sritz] insert AltLabel (id: null category: primary text: Micro-g LaCoste FG5 and FG5X language code: en);
change note: 2019-04-30 13:07:19.0 [sritz] Insert Concept add broader relation (FG5 [f5cbbf7c-a3b6-4969-9ae9-0fdb3e86e23b,368733] - Gravimeters [1707b0ef-5e6f-4abc-bd7b-905c4ea18ba7,346415]);
change note: 2019-04-30 13:09:46.0 [sritz] update Definition ([Source: Micro-g LaCoste home page] Micro-g LaCoste is proud to announce the new state of the art in absolute gravity measurements! The FG5-X is a “follow on” instrument to the “absolute standard” that is the FG5 freefall gravimeter. The FG5-X featrues an improved dropping chamber and an improved electronic interface. More Information: http://microglacoste.com/product/fg5-x-fgl-absolute-gravimeter/);
definition: [Source: Micro-g LaCoste home page] Micro-g LaCoste is proud to announce the new state of the art in absolute gravity measurements! The FG5-X is a “follow on” instrument to the “absolute standard” that is the FG5 freefall gravimeter. The FG5-X featrues an improved dropping chamber and an improved electronic interface. More Information: http://microglacoste.com/product/fg5-x-fgl-absolute-gravimeter/
in scheme: instruments