P - R
type: Concept

PALEOMAP
type: Concept
definition: The goal of the PALEOMAP Project is to illustrate the plate tectonic development of the ocean basins and continents, as well as the changing distribution of land and sea during the past 1100 million years. For more information, link to "http://www.scotese.com/Default.htm"
in scheme: projects