CARBON
type: Concept

NET ECOSYSTEM CO2 EXCHANGE (NEE)
type: Concept
change note: 2020-01-17 19:18:15.0 [sritz] Insert Concept add broader relation (NET ECOSYSTEM CO2 EXCHANGE (NEE) [f6a8db71-9686-46ec-a3ac-66ca4a0ec1bd,559693] - CARBON [a7ae5843-479c-4055-b8fc-ba651e485750,84059]);
definition: "NEE of CO2" with the atmosphere is a fundamental measure of the balance between carbon uptake by the vegetation "GPP" and carbon losses through "autotrophic" and "heterotrophic respiration".
in scheme: sciencekeywords