SEA ICE
type: Concept

ICE TEMPERATURE
type: Concept
definition: Measurements of the temperature of the sea ice and surrounding sea surface temperature. These measurements are usually obtained from remote sensing satellites.
in scheme: sciencekeywords