A - C
type: Concept

ARD
type: Concept
definition: Short Title: ARD Proposal URL:http://classic.ipy.org/development/eoi/proposal-details.php?id=411 The purposes of the project are to employ existing and new data and information to describe and analyse, i) onshore and offshore mineral and biological resources in the Norwegian and Russian Arctic from northern Norway and the Kola Peninsula in the west to the Bering Strait in the east, ii) existing and planned economic and commercial activities based on the resources, iii) environmental, infrastructural, economic, social, and institutional factors and conditions of importance to the exploitation of the resources and to particular types of business and investment opportunities, and iv) within a paradigm of sustainable development, create plausible scenarios of social, economic, and commercial trends over the next 10-20 and 20-40 years. The overall aim is to, produce a source of data, information, and analyses about the natural resources of the northern and Arctic parts of Norway and Russia that is unique and will be judged to be the obvious first choice of consultation for investment information and opportunities by state and private companies and organizations in Norway, Russia, and elsewhere. The project has five sections. Section 1 will consist of the most comprehensive description of mineral and biological resources and activites based on them so far undertaken. Section 2 will give an exhaustive account of infrastruture, especially transportation, communication, and logistical factors. Section 3 will concentrate on environmental factors, challenges, and conditions adverse or conducive to sustainable exploitation of the natural resources. Section 4 will describe and analyse economic, social, legal, and institutional factors that in various ways will affect the viability of economic and commercial activities. Section 5 will build on and draw together the results of the previous sections to make scenarios of sustainable development in the regions over the next 10-20 and…
in scheme: projects