Chemical Meters/Analyzers
type: Concept

LICOR SOIL GAS CHAMBER
type: Concept
change note: 2021-08-05 12:38:47.0 [sritz] insert AltLabel (id: null category: primary text: LICOR SOIL GAS CHAMBER language code: en);
definition: The LICOR Soil Gas Chamber measures soil CO2 flux. The chamber has infrared analyzers built into the sensor head. See: http://www.licor.com/env/Products/li6400/6400_soil.jsp
in scheme: instruments