A - C
type: Concept

CFRP III
type: Concept
definition: The Australian Cold Front Research Project (CFRP) Phase III case study focused on a cool change passage that took place over the south coast of Australia (approximate area 47S-27S latitude, 125E-157E longitude) over the time period November 17-19, 1984. View data, images, and animations at "http://isccp.giss.nasa.gov/projects/gewex-wg3.html#cfrp3" [Summary provided by NASA]
in scheme: projects