DISCHARGE/FLOW
type: Concept

FLOW VELOCITY
type: Concept
change note: 2016-04-04 09:11:27.0 [gee-cee] update Definition (Flow velocity is the speed at which a fluid flows.);
change note: 2016-03-31 09:03:36.0 [gee-cee] insert Definition (id: null text: Flow velocity is the speed at which a fluid flows language code: en);
change note: 2016-03-31 09:03:00.0 [gee-cee] Insert Concept add broader relation (FLOW VELOCITY [f77adcc6-e320-4fd9-80c9-958e75cd46d3,158739] - DISCHARGE/FLOW [36a2999b-2255-4d4e-a249-40df3b7b3aaf,158733]);
definition: Flow velocity is the speed at which a fluid flows.
in scheme: sciencekeywords