Earth Observation Satellites
type: Concept

JERS-1
type: Concept

Japanese Earth Resources Satellite (JERS)
type: Concept
change note: 2022-03-03 09:06:45.0 [tstevens] insert Definition (id: null text: JERS (Japanese Earth Resources Satellite) was a Japanese Earth observation satellite launched by NASDA (National Space Development Agency); also known by the national name Fuyo. Following on the success of MOS, JERS tested the performance of optical sensors and a synthetic aperture radar, and made observations for use in land survey, agriculture, forestry, fishery, environmental preservation, disaster prevention, and coastal surveillance. Some of its data were shared with the University of Alaska for research purposes. language code: en);
change note: 2021-12-02 09:29:36.0 [tstevens] update PrefLabel (Japanese Earth Resources Satellite (JERS));
definition: JERS (Japanese Earth Resources Satellite) was a Japanese Earth observation satellite launched by NASDA (National Space Development Agency); also known by the national name Fuyo. Following on the success of MOS, JERS tested the performance of optical sensors and a synthetic aperture radar, and made observations for use in land survey, agriculture, forestry, fishery, environmental preservation, disaster prevention, and coastal surveillance. Some of its data were shared with the University of Alaska for research purposes.
in scheme: platforms