Surface
type: Concept

R/V AMA
type: Concept
change note: 2022-02-22 15:17:31.0 [tstevens] insert Definition (id: null text: A fishing support vessel built in 2001 and currently sailing under the flag of Morocco. language code: en);
change note: 2021-11-18 09:31:34.0 [tstevens] Move Concepts delete broader relation (null); add broader relation (R/V AMA [f7a8f86c-08cc-4792-9ef0-50db79865e93,826914] - Surface [59b97a6c-385e-40a2-8422-ecbdb6023c4c,835900]);
definition: A fishing support vessel built in 2001 and currently sailing under the flag of Morocco.
in scheme: platforms