TERRAIN ELEVATION
type: Concept

TOPOGRAPHICAL RELIEF MAPS
type: Concept
change note: 2013-08-16 09:52:37.0 [tbs1979] update Definition (A type of map characterized by large-scale detail and quantitative representation of relief, usually using contour lines in modern mapping, but historically using a variety of methods. Traditional definitions require a topographic map to show both natural and man-made features. A topographic map is typically published as a map series, made up of two or more map sheets that combine to form the whole map. A contour line is a combination of two line segments that connect but do not intersect; these represent elevation on a topographic map.); update Definition (Natural Resources Canada);
change note: 2013-08-05 10:41:34.0 [tbs1979] update PrefLabel (TOPOGRAPHICAL RELIEF MAPS);
change note: 2013-08-05 10:41:14.0 [tbs1979] Move Concepts delete broader relation (null); add broader relation (TOPOGRAPHICAL RELIEF [f7d2e34a-c5c2-4c21-9132-2472620dbda1,85491] - TERRAIN ELEVATION [74ed1690-968e-444c-8a31-7b8344a2aad3,86767]);
definition: A type of map characterized by large-scale detail and quantitative representation of relief, usually using contour lines in modern mapping, but historically using a variety of methods. Traditional definitions require a topographic map to show both natural and man-made features. A topographic map is typically published as a map series, made up of two or more map sheets that combine to form the whole map. A contour line is a combination of two line segments that connect but do not intersect; these represent elevation on a topographic map.
in scheme: sciencekeywords