METAMORPHIC ROCK PHYSICAL/OPTICAL PROPERTIES
type: Concept

LUMINESCENCE
type: Concept
change note: 2013-03-14 14:27:55.0 [tbs1979] insert Definition (id: null text: It is the emission of “cold light” from minerals. There are several varieties of luminescence, each named according to the source of energy, or the trigger for the luminescence. language code: en);
change note: 2013-03-05 12:34:14.0 [tbs1979] Insert Concept add broader relation (LUMINESCENCE [f8740a28-ec13-4ce8-8541-2ecae035b297,82997] - METAMORPHIC ROCK PHYSICAL/OPTICAL PROPERTIES [2d38e7c6-8169-49e9-ab9d-0d0f690cce04,82971]);
definition: It is the emission of “cold light” from minerals. There are several varieties of luminescence, each named according to the source of energy, or the trigger for the luminescence.
in scheme: sciencekeywords