ACADEMIC
type: Concept

DUKE/MGEL
type: Concept
definition: The Duke University Marine Geospatial Ecology Lab applies geospatial technologies to issues in marine ecology, resource management and ocean conservation. [Summary provided by Duke University.]
in scheme: providers