SPECIES/POPULATION INTERACTIONS
type: Concept

ENDANGERED SPECIES
type: Concept
definition: An endangered species is a species in imminent danger of extinction throughout all or a significant portion of its range.
in scheme: sciencekeywords