Reports
type: Concept

MISSION REPORTS
type: Concept
alternative label: MISSION REPORT
change note: 2021-11-30 12:44:10.0 [tstevens] Move Concepts delete broader relation (null); add broader relation (MISSION REPORTS [f9846838-fdbc-4aa0-86e9-b0e70e97d0e2,826922] - Reports [d62db12c-fdcf-40ec-a714-4fb7c615aebe,835914]);
change note: 2016-06-09 14:49:32.0 [epneff] added altLabel insert AltLabel (id: null text: MISSION REPORT language code: en);
change note: 2012-10-24 14:22:41.0 [saritz] Insert Concept add broader relation (MISSION REPORTS [f9846838-fdbc-4aa0-86e9-b0e70e97d0e2,81979] - Maps/Charts/Photographs [af11dd2a-e514-4329-bbc5-0f36f2776a26,73527]);
definition: A document describing an observation flight, which is completed after the termination of the observation flight by the observing Party and which is signed by both the observing and observed Parties. [Source: Federation of American Scientists, Glossary of Open Skies Treaty Terms, http://www.fas.org/nuke/control/os/os_glsry.html ] Group: Platform_Details Entry_ID: MISSION REPORTS Group: Platform_Identification Platform_Category: Maps/Charts/Photographs Short_Name: MISSION REPORTS End_Group Creation_Date: 2012-10-24 End_Group
in scheme: platforms