REEF
type: Concept

CORAL REEF
type: Concept
change note: 2016-06-14 11:36:47.0 [gee-cee] insert Definition (id: null text: Pertaining to a reef made up chiefly of corals, coral sands, algal and other deposits, and the solid limestone resulting from their consolidation. language code: en);
change note: 2016-06-14 11:36:13.0 [gee-cee] Insert Concept add broader relation (CORAL REEF [fa3bc02d-31a7-4456-b716-a8b8f8393c86,188233] - REEF HABITAT [367718c8-cc3b-4c94-a270-0a278afabb43,84267]);
definition: Pertaining to a reef made up chiefly of corals, coral sands, algal and other deposits, and the solid limestone resulting from their consolidation.
in scheme: sciencekeywords